Error Building Native Android App

0
Hi, I am trying to build my Android app. I am getting the following error:   2022-11-25T09:04:10.6199280Z > Task :react-native-firebase_messaging:compileReleaseJavaWithJavac FAILED 2022-11-25T09:04:10.6299160Z An exception has occurred in the compiler (1.8.0_352). Please file a bug against the Java compiler via the Java bug reporting page (http://bugreport.java.com) after checking the Bug Database (http://bugs.java.com) for duplicates. Include your program and the following diagnostic in your report. Thank you. 2022-11-25T09:04:10.6400100Z java.lang.AssertionError: annotationType(): unrecognized Attribute name MODULE (class com.sun.tools.javac.util.UnsharedNameTable$NameImpl) 2022-11-25T09:04:10.6501610Z at com.sun.tools.javac.util.Assert.error(Assert.java:133) 2022-11-25T09:04:10.6602650Z at com.sun.tools.javac.code.TypeAnnotations.annotationType(TypeAnnotations.java:231) 2022-11-25T09:04:10.6702940Z at com.sun.tools.javac.code.TypeAnnotations$TypeAnnotationPositions.separateAnnotationsKinds(TypeAnnotations.java:294) 2022-11-25T09:04:10.6804180Z at com.sun.tools.javac.code.TypeAnnotations$TypeAnnotationPositions.visitMethodDef(TypeAnnotations.java:1066) 2022-11-25T09:04:10.6905440Z at com.sun.tools.javac.tree.JCTree$JCMethodDecl.accept(JCTree.java:778) 2022-11-25T09:04:10.7005450Z at com.sun.tools.javac.tree.TreeScanner.scan(TreeScanner.java:49) 2022-11-25T09:04:10.7106840Z at com.sun.tools.javac.code.TypeAnnotations$TypeAnnotationPositions.scan(TypeAnnotations.java:275) 2022-11-25T09:04:10.7207680Z at com.sun.tools.javac.tree.TreeScanner.scan(TreeScanner.java:57) 2022-11-25T09:04:10.7309180Z at com.sun.tools.javac.code.TypeAnnotations$TypeAnnotationPositions.visitClassDef(TypeAnnotations.java:1042) 2022-11-25T09:04:10.7310230Z at com.sun.tools.javac.tree.JCTree$JCClassDecl.accept(JCTree.java:693) 2022-11-25T09:04:10.7411880Z at com.sun.tools.javac.tree.TreeScanner.scan(TreeScanner.java:49) 2022-11-25T09:04:10.7513760Z at com.sun.tools.javac.code.TypeAnnotations$TypeAnnotationPositions.scan(TypeAnnotations.java:275) 2022-11-25T09:04:10.7615600Z at com.sun.tools.javac.code.TypeAnnotations$1.run(TypeAnnotations.java:127) 2022-11-25T09:04:10.7717390Z at com.sun.tools.javac.comp.Annotate.flush(Annotate.java:152) 2022-11-25T09:04:10.7819200Z at com.sun.tools.javac.comp.Annotate.enterDone(Annotate.java:129) 2022-11-25T09:04:10.7921210Z at com.sun.tools.javac.comp.Enter.complete(Enter.java:512) 2022-11-25T09:04:10.8022990Z at com.sun.tools.javac.comp.Enter.main(Enter.java:471) 2022-11-25T09:04:10.8119070Z at com.sun.tools.javac.main.JavaCompiler.enterTrees(JavaCompiler.java:982) 2022-11-25T09:04:10.8220890Z at com.sun.tools.javac.main.JavaCompiler.compile(JavaCompiler.java:857) 2022-11-25T09:04:10.8328970Z at com.sun.tools.javac.main.Main.compile(Main.java:523) 2022-11-25T09:04:10.8431840Z at com.sun.tools.javac.api.JavacTaskImpl.doCall(JavacTaskImpl.java:129) 2022-11-25T09:04:10.8533710Z at com.sun.tools.javac.api.JavacTaskImpl.call(JavacTaskImpl.java:138) 2022-11-25T09:04:10.8635610Z at org.gradle.internal.compiler.java.IncrementalCompileTask.call(IncrementalCompileTask.java:74) 2022-11-25T09:04:10.8737630Z at org.gradle.api.internal.tasks.compile.AnnotationProcessingCompileTask.call(AnnotationProcessingCompileTask.java:93) 2022-11-25T09:04:10.8839580Z at org.gradle.api.internal.tasks.compile.ResourceCleaningCompilationTask.call(ResourceCleaningCompilationTask.java:57) 2022-11-25T09:04:10.8941610Z at org.gradle.api.internal.tasks.compile.JdkJavaCompiler.execute(JdkJavaCompiler.java:55) 2022-11-25T09:04:10.9042940Z at org.gradle.api.internal.tasks.compile.JdkJavaCompiler.execute(JdkJavaCompiler.java:40) 2022-11-25T09:04:10.9144220Z at org.gradle.api.internal.tasks.compile.NormalizingJavaCompiler.delegateAndHandleErrors(NormalizingJavaCompiler.java:97) 2022-11-25T09:04:10.9245240Z at org.gradle.api.internal.tasks.compile.NormalizingJavaCompiler.execute(NormalizingJavaCompiler.java:51) 2022-11-25T09:04:10.9346680Z at org.gradle.api.internal.tasks.compile.NormalizingJavaCompiler.execute(NormalizingJavaCompiler.java:37) 2022-11-25T09:04:10.9447690Z at org.gradle.api.internal.tasks.compile.AnnotationProcessorDiscoveringCompiler.execute(AnnotationProcessorDiscoveringCompiler.java:51) 2022-11-25T09:04:10.9549070Z at org.gradle.api.internal.tasks.compile.AnnotationProcessorDiscoveringCompiler.execute(AnnotationProcessorDiscoveringCompiler.java:37) 2022-11-25T09:04:10.9650120Z at org.gradle.api.internal.tasks.compile.ModuleApplicationNameWritingCompiler.execute(ModuleApplicationNameWritingCompiler.java:46) 2022-11-25T09:04:10.9751500Z at org.gradle.api.internal.tasks.compile.ModuleApplicationNameWritingCompiler.execute(ModuleApplicationNameWritingCompiler.java:36) 2022-11-25T09:04:10.9853030Z at org.gradle.api.internal.tasks.compile.CleaningJavaCompiler.execute(CleaningJavaCompiler.java:53) 2022-11-25T09:04:10.9954050Z at org.gradle.api.internal.tasks.compile.incremental.IncrementalCompilerFactory.lambda$createRebuildAllCompiler$0(IncrementalCompilerFactory.java:98) 2022-11-25T09:04:11.0056340Z at org.gradle.api.internal.tasks.compile.incremental.IncrementalResultStoringCompiler.execute(IncrementalResultStoringCompiler.java:60) 2022-11-25T09:04:11.0156530Z at org.gradle.api.internal.tasks.compile.incremental.IncrementalResultStoringCompiler.execute(IncrementalResultStoringCompiler.java:44) 2022-11-25T09:04:11.0258920Z at org.gradle.api.internal.tasks.compile.CompileJavaBuildOperationReportingCompiler$2.call(CompileJavaBuildOperationReportingCompiler.java:59) 2022-11-25T09:04:11.0361150Z at org.gradle.api.internal.tasks.compile.CompileJavaBuildOperationReportingCompiler$2.call(CompileJavaBuildOperationReportingCompiler.java:51) 2022-11-25T09:04:11.0463590Z at org.gradle.internal.operations.DefaultBuildOperationExecutor$CallableBuildOperationWorker.execute(DefaultBuildOperationExecutor.java:409) 2022-11-25T09:04:11.0563570Z at org.gradle.internal.operations.DefaultBuildOperationExecutor$CallableBuildOperationWorker.execute(DefaultBuildOperationExecutor.java:399) 2022-11-25T09:04:11.0665780Z at org.gradle.internal.operations.DefaultBuildOperationExecutor$1.execute(DefaultBuildOperationExecutor.java:157) 2022-11-25T09:04:11.0766060Z at org.gradle.internal.operations.DefaultBuildOperationExecutor.execute(DefaultBuildOperationExecutor.java:242) 2022-11-25T09:04:11.0868030Z at org.gradle.internal.operations.DefaultBuildOperationExecutor.execute(DefaultBuildOperationExecutor.java:150) 2022-11-25T09:04:11.0968280Z at org.gradle.internal.operations.DefaultBuildOperationExecutor.call(DefaultBuildOperationExecutor.java:94) 2022-11-25T09:04:11.1070280Z at org.gradle.internal.operations.DelegatingBuildOperationExecutor.call(DelegatingBuildOperationExecutor.java:36) 2022-11-25T09:04:11.1170600Z at org.gradle.api.internal.tasks.compile.CompileJavaBuildOperationReportingCompiler.execute(CompileJavaBuildOperationReportingCompiler.java:51) 2022-11-25T09:04:11.1272690Z at org.gradle.api.tasks.compile.JavaCompile.performCompilation(JavaCompile.java:293) 2022-11-25T09:04:11.1372860Z at org.gradle.api.tasks.compile.JavaCompile.performIncrementalCompilation(JavaCompile.java:203) 2022-11-25T09:04:11.1474710Z at org.gradle.api.tasks.compile.JavaCompile.compile(JavaCompile.java:183) 2022-11-25T09:04:11.1576420Z at sun.reflect.NativeMethodAccessorImpl.invoke0(Native Method) 2022-11-25T09:04:11.1676720Z at sun.reflect.NativeMethodAccessorImpl.invoke(NativeMethodAccessorImpl.java:62) 2022-11-25T09:04:11.1778570Z at sun.reflect.DelegatingMethodAccessorImpl.invoke(DelegatingMethodAccessorImpl.java:43) 2022-11-25T09:04:11.1878730Z at java.lang.reflect.Method.invoke(Method.java:498) 2022-11-25T09:04:11.1980600Z at org.gradle.internal.reflect.JavaMethod.invoke(JavaMethod.java:104) 2022-11-25T09:04:11.2081920Z at org.gradle.api.internal.project.taskfactory.IncrementalInputsTaskAction.doExecute(IncrementalInputsTaskAction.java:32) 2022-11-25T09:04:11.2182810Z at org.gradle.api.internal.project.taskfactory.StandardTaskAction.execute(StandardTaskAction.java:42) 2022-11-25T09:04:11.2284350Z at org.gradle.api.internal.project.taskfactory.AbstractIncrementalTaskAction.execute(AbstractIncrementalTaskAction.java:25) 2022-11-25T09:04:11.2385280Z at org.gradle.api.internal.project.taskfactory.StandardTaskAction.execute(StandardTaskAction.java:28) 2022-11-25T09:04:11.2486790Z at org.gradle.api.internal.tasks.execution.ExecuteActionsTaskExecuter$3.run(ExecuteActionsTaskExecuter.java:569) 2022-11-25T09:04:11.2587720Z at org.gradle.internal.operations.DefaultBuildOperationExecutor$RunnableBuildOperationWorker.execute(DefaultBuildOperationExecutor.java:395) 2022-11-25T09:04:11.2689270Z at org.gradle.internal.operations.DefaultBuildOperationExecutor$RunnableBuildOperationWorker.execute(DefaultBuildOperationExecutor.java:387) 2022-11-25T09:04:11.2790820Z at org.gradle.internal.operations.DefaultBuildOperationExecutor$1.execute(DefaultBuildOperationExecutor.java:157) 2022-11-25T09:04:11.2891820Z at org.gradle.internal.operations.DefaultBuildOperationExecutor.execute(DefaultBuildOperationExecutor.java:242) 2022-11-25T09:04:11.2993630Z at org.gradle.internal.operations.DefaultBuildOperationExecutor.execute(DefaultBuildOperationExecutor.java:150) 2022-11-25T09:04:11.3094380Z at org.gradle.internal.operations.DefaultBuildOperationExecutor.run(DefaultBuildOperationExecutor.java:84) 2022-11-25T09:04:11.3196150Z at org.gradle.internal.operations.DelegatingBuildOperationExecutor.run(DelegatingBuildOperationExecutor.java:31) 2022-11-25T09:04:11.3290930Z at org.gradle.api.internal.tasks.execution.ExecuteActionsTaskExecuter.executeAction(ExecuteActionsTaskExecuter.java:554) 2022-11-25T09:04:11.3393190Z at org.gradle.api.internal.tasks.execution.ExecuteActionsTaskExecuter.executeActions(ExecuteActionsTaskExecuter.java:537) 2022-11-25T09:04:11.3493370Z at org.gradle.api.internal.tasks.execution.ExecuteActionsTaskExecuter.access$300(ExecuteActionsTaskExecuter.java:108) 2022-11-25T09:04:11.3595700Z at org.gradle.api.internal.tasks.execution.ExecuteActionsTaskExecuter$TaskExecution.executeWithPreviousOutputFiles(ExecuteActionsTaskExecuter.java:278) 2022-11-25T09:04:11.3695940Z at org.gradle.api.internal.tasks.execution.ExecuteActionsTaskExecuter$TaskExecution.execute(ExecuteActionsTaskExecuter.java:267) 2022-11-25T09:04:11.3798120Z at org.gradle.internal.execution.steps.ExecuteStep.lambda$execute$0(ExecuteStep.java:32) 2022-11-25T09:04:11.3898170Z at java.util.Optional.map(Optional.java:215) 2022-11-25T09:04:11.4000190Z at org.gradle.internal.execution.steps.ExecuteStep.execute(ExecuteStep.java:32) 2022-11-25T09:04:11.4101030Z at org.gradle.internal.execution.steps.ExecuteStep.execute(ExecuteStep.java:26) 2022-11-25T09:04:11.4202800Z at org.gradle.internal.execution.steps.CleanupOutputsStep.execute(CleanupOutputsStep.java:67) 2022-11-25T09:04:11.4303420Z at org.gradle.internal.execution.steps.CleanupOutputsStep.execute(CleanupOutputsStep.java:36) 2022-11-25T09:04:11.4405070Z at org.gradle.internal.execution.steps.ResolveInputChangesStep.execute(ResolveInputChangesStep.java:49) 2022-11-25T09:04:11.4505840Z at org.gradle.internal.execution.steps.ResolveInputChangesStep.execute(ResolveInputChangesStep.java:34) 2022-11-25T09:04:11.4607460Z at org.gradle.internal.execution.steps.CancelExecutionStep.execute(CancelExecutionStep.java:43) 2022-11-25T09:04:11.4709910Z at org.gradle.internal.execution.steps.TimeoutStep.executeWithoutTimeout(TimeoutStep.java:73) 2022-11-25T09:04:11.4810470Z at org.gradle.internal.execution.steps.TimeoutStep.execute(TimeoutStep.java:54) 2022-11-25T09:04:11.4912160Z at org.gradle.internal.execution.steps.CatchExceptionStep.execute(CatchExceptionStep.java:34) 2022-11-25T09:04:11.4913220Z at org.gradle.internal.execution.steps.CreateOutputsStep.execute(CreateOutputsStep.java:44) 2022-11-25T09:04:11.5016800Z at org.gradle.internal.execution.steps.SnapshotOutputsStep.execute(SnapshotOutputsStep.java:54) 2022-11-25T09:04:11.5113460Z at org.gradle.internal.execution.steps.SnapshotOutputsStep.execute(SnapshotOutputsStep.java:38) 2022-11-25T09:04:11.5215400Z at org.gradle.internal.execution.steps.BroadcastChangingOutputsStep.execute(BroadcastChangingOutputsStep.java:49) 2022-11-25T09:04:11.5317410Z at org.gradle.internal.execution.steps.CacheStep.executeWithoutCache(CacheStep.java:159) 2022-11-25T09:04:11.5419400Z at org.gradle.internal.execution.steps.CacheStep.execute(CacheStep.java:72) 2022-11-25T09:04:11.5519560Z at org.gradle.internal.execution.steps.CacheStep.execute(CacheStep.java:43) 2022-11-25T09:04:11.5621480Z at org.gradle.internal.execution.steps.StoreExecutionStateStep.execute(StoreExecutionStateStep.java:44) 2022-11-25T09:04:11.5721690Z at org.gradle.internal.execution.steps.StoreExecutionStateStep.execute(StoreExecutionStateStep.java:33) 2022-11-25T09:04:11.5820750Z at org.gradle.internal.execution.steps.RecordOutputsStep.execute(RecordOutputsStep.java:38) 2022-11-25T09:04:11.5922860Z at org.gradle.internal.execution.steps.RecordOutputsStep.execute(RecordOutputsStep.java:24) 2022-11-25T09:04:11.6024920Z at org.gradle.internal.execution.steps.SkipUpToDateStep.executeBecause(SkipUpToDateStep.java:92) 2022-11-25T09:04:11.6122270Z at org.gradle.internal.execution.steps.SkipUpToDateStep.lambda$execute$0(SkipUpToDateStep.java:85) 2022-11-25T09:04:11.6224160Z at java.util.Optional.map(Optional.java:215) 2022-11-25T09:04:11.6326060Z at org.gradle.internal.execution.steps.SkipUpToDateStep.execute(SkipUpToDateStep.java:55) 2022-11-25T09:04:11.6427400Z at org.gradle.internal.execution.steps.SkipUpToDateStep.execute(SkipUpToDateStep.java:39) 2022-11-25T09:04:11.6528260Z at org.gradle.internal.execution.steps.ResolveChangesStep.execute(ResolveChangesStep.java:76) 2022-11-25T09:04:11.6621140Z at org.gradle.internal.execution.steps.ResolveChangesStep.execute(ResolveChangesStep.java:37) 2022-11-25T09:04:11.6682530Z at org.gradle.internal.execution.steps.legacy.MarkSnapshottingInputsFinishedStep.execute(MarkSnapshottingInputsFinishedStep.java:36) 2022-11-25T09:04:11.6709560Z at org.gradle.internal.execution.steps.legacy.MarkSnapshottingInputsFinishedStep.execute(MarkSnapshottingInputsFinishedStep.java:26) 2022-11-25T09:04:11.6716860Z at org.gradle.internal.execution.steps.ResolveCachingStateStep.execute(ResolveCachingStateStep.java:94) 2022-11-25T09:04:11.6740730Z at org.gradle.internal.execution.steps.ResolveCachingStateStep.execute(ResolveCachingStateStep.java:49) 2022-11-25T09:04:11.6842590Z at org.gradle.internal.execution.steps.CaptureStateBeforeExecutionStep.execute(CaptureStateBeforeExecutionStep.java:79) 2022-11-25T09:04:11.6944690Z at org.gradle.internal.execution.steps.CaptureStateBeforeExecutionStep.execute(CaptureStateBeforeExecutionStep.java:53) 2022-11-25T09:04:11.7046770Z at org.gradle.internal.execution.steps.ValidateStep.execute(ValidateStep.java:74) 2022-11-25T09:04:11.7148910Z at org.gradle.internal.execution.steps.SkipEmptyWorkStep.lambda$execute$2(SkipEmptyWorkStep.java:78) 2022-11-25T09:04:11.7250740Z at java.util.Optional.orElseGet(Optional.java:267) 2022-11-25T09:04:11.7345620Z at org.gradle.internal.execution.steps.SkipEmptyWorkStep.execute(SkipEmptyWorkStep.java:78) 2022-11-25T09:04:11.7436230Z at org.gradle.internal.execution.steps.SkipEmptyWorkStep.execute(SkipEmptyWorkStep.java:34) 2022-11-25T09:04:11.7538300Z at org.gradle.internal.execution.steps.legacy.MarkSnapshottingInputsStartedStep.execute(MarkSnapshottingInputsStartedStep.java:39) 2022-11-25T09:04:11.7640640Z at org.gradle.internal.execution.steps.LoadExecutionStateStep.execute(LoadExecutionStateStep.java:40) 2022-11-25T09:04:11.7742640Z at org.gradle.internal.execution.steps.LoadExecutionStateStep.execute(LoadExecutionStateStep.java:28) 2022-11-25T09:04:11.7844800Z at org.gradle.internal.execution.impl.DefaultWorkExecutor.execute(DefaultWorkExecutor.java:33) 2022-11-25T09:04:11.7947420Z at org.gradle.api.internal.tasks.execution.ExecuteActionsTaskExecuter.executeIfValid(ExecuteActionsTaskExecuter.java:194) 2022-11-25T09:04:11.8010610Z at org.gradle.api.internal.tasks.execution.ExecuteActionsTaskExecuter.execute(ExecuteActionsTaskExecuter.java:186) 2022-11-25T09:04:11.8044710Z at org.gradle.api.internal.tasks.execution.CleanupStaleOutputsExecuter.execute(CleanupStaleOutputsExecuter.java:114) 2022-11-25T09:04:11.8122870Z at org.gradle.api.internal.tasks.execution.FinalizePropertiesTaskExecuter.execute(FinalizePropertiesTaskExecuter.java:46) 2022-11-25T09:04:11.8224980Z at org.gradle.api.internal.tasks.execution.ResolveTaskExecutionModeExecuter.execute(ResolveTaskExecutionModeExecuter.java:62) 2022-11-25T09:04:11.8327060Z at org.gradle.api.internal.tasks.execution.SkipTaskWithNoActionsExecuter.execute(SkipTaskWithNoActionsExecuter.java:57) 2022-11-25T09:04:11.8429780Z at org.gradle.api.internal.tasks.execution.SkipOnlyIfTaskExecuter.execute(SkipOnlyIfTaskExecuter.java:56) 2022-11-25T09:04:11.8531470Z at org.gradle.api.internal.tasks.execution.CatchExceptionTaskExecuter.execute(CatchExceptionTaskExecuter.java:36) 2022-11-25T09:04:11.8623320Z at org.gradle.api.internal.tasks.execution.EventFiringTaskExecuter$1.executeTask(EventFiringTaskExecuter.java:77) 2022-11-25T09:04:11.8725300Z at org.gradle.api.internal.tasks.execution.EventFiringTaskExecuter$1.call(EventFiringTaskExecuter.java:55) 2022-11-25T09:04:11.8825550Z at org.gradle.api.internal.tasks.execution.EventFiringTaskExecuter$1.call(EventFiringTaskExecuter.java:52) 2022-11-25T09:04:11.8917780Z at org.gradle.internal.operations.DefaultBuildOperationExecutor$CallableBuildOperationWorker.execute(DefaultBuildOperationExecutor.java:409) 2022-11-25T09:04:11.9019970Z at org.gradle.internal.operations.DefaultBuildOperationExecutor$CallableBuildOperationWorker.execute(DefaultBuildOperationExecutor.java:399) 2022-11-25T09:04:11.9120080Z at org.gradle.internal.operations.DefaultBuildOperationExecutor$1.execute(DefaultBuildOperationExecutor.java:157) 2022-11-25T09:04:11.9192590Z at org.gradle.internal.operations.DefaultBuildOperationExecutor.execute(DefaultBuildOperationExecutor.java:242) 2022-11-25T09:04:11.9294700Z at org.gradle.internal.operations.DefaultBuildOperationExecutor.execute(DefaultBuildOperationExecutor.java:150) 2022-11-25T09:04:11.9394900Z at org.gradle.internal.operations.DefaultBuildOperationExecutor.call(DefaultBuildOperationExecutor.java:94) 2022-11-25T09:04:11.9496980Z at org.gradle.internal.operations.DelegatingBuildOperationExecutor.call(DelegatingBuildOperationExecutor.java:36) 2022-11-25T09:04:11.9597270Z at org.gradle.api.internal.tasks.execution.EventFiringTaskExecuter.execute(EventFiringTaskExecuter.java:52) 2022-11-25T09:04:11.9699370Z at org.gradle.execution.plan.LocalTaskNodeExecutor.execute(LocalTaskNodeExecutor.java:41) 2022-11-25T09:04:11.9801550Z at org.gradle.execution.taskgraph.DefaultTaskExecutionGraph$InvokeNodeExecutorsAction.execute(DefaultTaskExecutionGraph.java:356) 2022-11-25T09:04:11.9902960Z at org.gradle.execution.taskgraph.DefaultTaskExecutionGraph$InvokeNodeExecutorsAction.execute(DefaultTaskExecutionGraph.java:343) 2022-11-25T09:04:12.0004340Z at org.gradle.execution.taskgraph.DefaultTaskExecutionGraph$BuildOperationAwareExecutionAction.execute(DefaultTaskExecutionGraph.java:336) 2022-11-25T09:04:12.0106330Z at org.gradle.execution.taskgraph.DefaultTaskExecutionGraph$BuildOperationAwareExecutionAction.execute(DefaultTaskExecutionGraph.java:322) 2022-11-25T09:04:12.0208310Z at org.gradle.execution.plan.DefaultPlanExecutor$ExecutorWorker.lambda$run$0(DefaultPlanExecutor.java:127) 2022-11-25T09:04:12.0310500Z at org.gradle.execution.plan.DefaultPlanExecutor$ExecutorWorker.execute(DefaultPlanExecutor.java:191) 2022-11-25T09:04:12.0447040Z at org.gradle.execution.plan.DefaultPlanExecutor$ExecutorWorker.executeNextNode(DefaultPlanExecutor.java:182) 2022-11-25T09:04:12.0549250Z at org.gradle.execution.plan.DefaultPlanExecutor$ExecutorWorker.run(DefaultPlanExecutor.java:124) 2022-11-25T09:04:12.0651250Z at org.gradle.execution.plan.DefaultPlanExecutor.process(DefaultPlanExecutor.java:72) 2022-11-25T09:04:12.0752430Z at org.gradle.execution.taskgraph.DefaultTaskExecutionGraph.executeWithServices(DefaultTaskExecutionGraph.java:181) 2022-11-25T09:04:12.0854120Z at org.gradle.execution.taskgraph.DefaultTaskExecutionGraph.execute(DefaultTaskExecutionGraph.java:174) 2022-11-25T09:04:12.0955900Z at org.gradle.execution.SelectedTaskExecutionAction.execute(SelectedTaskExecutionAction.java:39) 2022-11-25T09:04:12.1057950Z at org.gradle.execution.DefaultBuildWorkExecutor.execute(DefaultBuildWorkExecutor.java:40) 2022-11-25T09:04:12.1159990Z at org.gradle.execution.DefaultBuildWorkExecutor.access$000(DefaultBuildWorkExecutor.java:24) 2022-11-25T09:04:12.1261410Z at org.gradle.execution.DefaultBuildWorkExecutor$1.proceed(DefaultBuildWorkExecutor.java:48) 2022-11-25T09:04:12.1362270Z at org.gradle.execution.DryRunBuildExecutionAction.execute(DryRunBuildExecutionAction.java:49) 2022-11-25T09:04:12.1464410Z at org.gradle.execution.DefaultBuildWorkExecutor.execute(DefaultBuildWorkExecutor.java:40) 2022-11-25T09:04:12.1557800Z at org.gradle.execution.DefaultBuildWorkExecutor.execute(DefaultBuildWorkExecutor.java:33) 2022-11-25T09:04:12.1659920Z at org.gradle.execution.IncludedBuildLifecycleBuildWorkExecutor.execute(IncludedBuildLifecycleBuildWorkExecutor.java:36) 2022-11-25T09:04:12.1761320Z at org.gradle.execution.DeprecateUndefinedBuildWorkExecutor.execute(DeprecateUndefinedBuildWorkExecutor.java:42) 2022-11-25T09:04:12.1862400Z at org.gradle.execution.BuildOperationFiringBuildWorkerExecutor$ExecuteTasks.run(BuildOperationFiringBuildWorkerExecutor.java:57) 2022-11-25T09:04:12.1963860Z at org.gradle.internal.operations.DefaultBuildOperationExecutor$RunnableBuildOperationWorker.execute(DefaultBuildOperationExecutor.java:395) 2022-11-25T09:04:12.2064950Z at org.gradle.internal.operations.DefaultBuildOperationExecutor$RunnableBuildOperationWorker.execute(DefaultBuildOperationExecutor.java:387) 2022-11-25T09:04:12.2167420Z at org.gradle.internal.operations.DefaultBuildOperationExecutor$1.execute(DefaultBuildOperationExecutor.java:157) 2022-11-25T09:04:12.2267580Z at org.gradle.internal.operations.DefaultBuildOperationExecutor.execute(DefaultBuildOperationExecutor.java:242) 2022-11-25T09:04:12.2369700Z at org.gradle.internal.operations.DefaultBuildOperationExecutor.execute(DefaultBuildOperationExecutor.java:150) 2022-11-25T09:04:12.2463430Z at org.gradle.internal.operations.DefaultBuildOperationExecutor.run(DefaultBuildOperationExecutor.java:84) 2022-11-25T09:04:12.2564640Z at org.gradle.internal.operations.DelegatingBuildOperationExecutor.run(DelegatingBuildOperationExecutor.java:31) 2022-11-25T09:04:12.2665830Z at org.gradle.execution.BuildOperationFiringBuildWorkerExecutor.execute(BuildOperationFiringBuildWorkerExecutor.java:42) 2022-11-25T09:04:12.2766940Z at org.gradle.initialization.DefaultGradleLauncher.runWork(DefaultGradleLauncher.java:257) 2022-11-25T09:04:12.2849340Z at org.gradle.initialization.DefaultGradleLauncher.doClassicBuildStages(DefaultGradleLauncher.java:164) 2022-11-25T09:04:12.2935120Z at org.gradle.initialization.DefaultGradleLauncher.doBuildStages(DefaultGradleLauncher.java:140) 2022-11-25T09:04:12.2995110Z at org.gradle.initialization.DefaultGradleLauncher.executeTasks(DefaultGradleLauncher.java:120) 2022-11-25T09:04:12.3047120Z at org.gradle.internal.invocation.GradleBuildController$1.create(GradleBuildController.java:74) 2022-11-25T09:04:12.3149260Z at org.gradle.internal.invocation.GradleBuildController$1.create(GradleBuildController.java:67) 2022-11-25T09:04:12.3249510Z at org.gradle.internal.work.DefaultWorkerLeaseService.withLocks(DefaultWorkerLeaseService.java:180) 2022-11-25T09:04:12.3351620Z at org.gradle.internal.work.StopShieldingWorkerLeaseService.withLocks(StopShieldingWorkerLeaseService.java:40) 2022-11-25T09:04:12.3451780Z at org.gradle.internal.invocation.GradleBuildController.doBuild(GradleBuildController.java:67) 2022-11-25T09:04:12.3553840Z at org.gradle.internal.invocation.GradleBuildController.run(GradleBuildController.java:56) 2022-11-25T09:04:12.3654640Z at org.gradle.tooling.internal.provider.ExecuteBuildActionRunner.run(ExecuteBuildActionRunner.java:31) 2022-11-25T09:04:12.3756790Z at org.gradle.launcher.exec.ChainingBuildActionRunner.run(ChainingBuildActionRunner.java:35) 2022-11-25T09:04:12.3858930Z at org.gradle.launcher.exec.BuildOutcomeReportingBuildActionRunner.run(BuildOutcomeReportingBuildActionRunner.java:63) 2022-11-25T09:04:12.3961200Z at org.gradle.tooling.internal.provider.ValidatingBuildActionRunner.run(ValidatingBuildActionRunner.java:32) 2022-11-25T09:04:12.4063630Z at org.gradle.launcher.exec.BuildCompletionNotifyingBuildActionRunner.run(BuildCompletionNotifyingBuildActionRunner.java:39) 2022-11-25T09:04:12.4162480Z at org.gradle.launcher.exec.RunAsBuildOperationBuildActionRunner$3.call(RunAsBuildOperationBuildActionRunner.java:51) 2022-11-25T09:04:12.4262670Z at org.gradle.launcher.exec.RunAsBuildOperationBuildActionRunner$3.call(RunAsBuildOperationBuildActionRunner.java:45) 2022-11-25T09:04:12.4327290Z at org.gradle.internal.operations.DefaultBuildOperationExecutor$CallableBuildOperationWorker.execute(DefaultBuildOperationExecutor.java:409) 2022-11-25T09:04:12.4369170Z at org.gradle.internal.operations.DefaultBuildOperationExecutor$CallableBuildOperationWorker.execute(DefaultBuildOperationExecutor.java:399) 2022-11-25T09:04:12.4398990Z at org.gradle.internal.operations.DefaultBuildOperationExecutor$1.execute(DefaultBuildOperationExecutor.java:157) 2022-11-25T09:04:12.4422120Z at org.gradle.internal.operations.DefaultBuildOperationExecutor.execute(DefaultBuildOperationExecutor.java:242) 2022-11-25T09:04:12.4423040Z at org.gradle.internal.operations.DefaultBuildOperationExecutor.execute(DefaultBuildOperationExecutor.java:150) 2022-11-25T09:04:12.4427370Z at org.gradle.internal.operations.DefaultBuildOperationExecutor.call(DefaultBuildOperationExecutor.java:94) 2022-11-25T09:04:12.4449570Z at org.gradle.internal.operations.DelegatingBuildOperationExecutor.call(DelegatingBuildOperationExecutor.java:36) 2022-11-25T09:04:12.4479250Z at org.gradle.launcher.exec.RunAsBuildOperationBuildActionRunner.run(RunAsBuildOperationBuildActionRunner.java:45) 2022-11-25T09:04:12.4561740Z at org.gradle.launcher.exec.InProcessBuildActionExecuter$1.transform(InProcessBuildActionExecuter.java:50) 2022-11-25T09:04:12.4663820Z at org.gradle.launcher.exec.InProcessBuildActionExecuter$1.transform(InProcessBuildActionExecuter.java:47) 2022-11-25T09:04:12.4765530Z at org.gradle.composite.internal.DefaultRootBuildState.run(DefaultRootBuildState.java:80) 2022-11-25T09:04:12.4866140Z at org.gradle.launcher.exec.InProcessBuildActionExecuter.execute(InProcessBuildActionExecuter.java:47) 2022-11-25T09:04:12.4967720Z at org.gradle.launcher.exec.InProcessBuildActionExecuter.execute(InProcessBuildActionExecuter.java:31) 2022-11-25T09:04:12.5069180Z at org.gradle.launcher.exec.BuildTreeScopeBuildActionExecuter.execute(BuildTreeScopeBuildActionExecuter.java:42) 2022-11-25T09:04:12.5170050Z at org.gradle.launcher.exec.BuildTreeScopeBuildActionExecuter.execute(BuildTreeScopeBuildActionExecuter.java:28) 2022-11-25T09:04:12.5271480Z at org.gradle.tooling.internal.provider.ContinuousBuildActionExecuter.execute(ContinuousBuildActionExecuter.java:87) 2022-11-25T09:04:12.5372410Z at org.gradle.tooling.internal.provider.ContinuousBuildActionExecuter.execute(ContinuousBuildActionExecuter.java:55) 2022-11-25T09:04:12.5473910Z at org.gradle.tooling.internal.provider.SubscribableBuildActionExecuter.execute(SubscribableBuildActionExecuter.java:60) 2022-11-25T09:04:12.5560360Z at org.gradle.tooling.internal.provider.SubscribableBuildActionExecuter.execute(SubscribableBuildActionExecuter.java:38) 2022-11-25T09:04:12.5614380Z at org.gradle.tooling.internal.provider.SessionScopeBuildActionExecuter.execute(SessionScopeBuildActionExecuter.java:68) 2022-11-25T09:04:12.5704870Z at org.gradle.tooling.internal.provider.SessionScopeBuildActionExecuter.execute(SessionScopeBuildActionExecuter.java:38) 2022-11-25T09:04:12.5801690Z at org.gradle.tooling.internal.provider.GradleThreadBuildActionExecuter.execute(GradleThreadBuildActionExecuter.java:37) 2022-11-25T09:04:12.5890800Z at org.gradle.tooling.internal.provider.GradleThreadBuildActionExecuter.execute(GradleThreadBuildActionExecuter.java:26) 2022-11-25T09:04:12.5992340Z at org.gradle.tooling.internal.provider.StartParamsValidatingActionExecuter.execute(StartParamsValidatingActionExecuter.java:60) 2022-11-25T09:04:12.6089500Z at org.gradle.tooling.internal.provider.StartParamsValidatingActionExecuter.execute(StartParamsValidatingActionExecuter.java:32) 2022-11-25T09:04:12.6191790Z at org.gradle.tooling.internal.provider.SessionFailureReportingActionExecuter.execute(SessionFailureReportingActionExecuter.java:56) 2022-11-25T09:04:12.6287620Z at org.gradle.tooling.internal.provider.SessionFailureReportingActionExecuter.execute(SessionFailureReportingActionExecuter.java:42) 2022-11-25T09:04:12.6390510Z at org.gradle.tooling.internal.provider.SetupLoggingActionExecuter.execute(SetupLoggingActionExecuter.java:48) 2022-11-25T09:04:12.6491460Z at org.gradle.tooling.internal.provider.SetupLoggingActionExecuter.execute(SetupLoggingActionExecuter.java:32) 2022-11-25T09:04:12.6581210Z at org.gradle.launcher.daemon.server.exec.ExecuteBuild.doBuild(ExecuteBuild.java:68) 2022-11-25T09:04:12.6682460Z at org.gradle.launcher.daemon.server.exec.BuildCommandOnly.execute(BuildCommandOnly.java:37) 2022-11-25T09:04:12.6781090Z at org.gradle.launcher.daemon.server.api.DaemonCommandExecution.proceed(DaemonCommandExecution.java:104) 2022-11-25T09:04:12.6882360Z at org.gradle.launcher.daemon.server.exec.WatchForDisconnection.execute(WatchForDisconnection.java:39) 2022-11-25T09:04:12.6940520Z at org.gradle.launcher.daemon.server.api.DaemonCommandExecution.proceed(DaemonCommandExecution.java:104) 2022-11-25T09:04:12.6975460Z at org.gradle.launcher.daemon.server.exec.ResetDeprecationLogger.execute(ResetDeprecationLogger.java:29) 2022-11-25T09:04:12.7005950Z at org.gradle.launcher.daemon.server.api.DaemonCommandExecution.proceed(DaemonCommandExecution.java:104) 2022-11-25T09:04:12.7108230Z at org.gradle.launcher.daemon.server.exec.RequestStopIfSingleUsedDaemon.execute(RequestStopIfSingleUsedDaemon.java:35) 2022-11-25T09:04:12.7210290Z at org.gradle.launcher.daemon.server.api.DaemonCommandExecution.proceed(DaemonCommandExecution.java:104) 2022-11-25T09:04:12.7312460Z at org.gradle.launcher.daemon.server.exec.ForwardClientInput$2.create(ForwardClientInput.java:78) 2022-11-25T09:04:12.7408620Z Error: /Users/runner/work/1/s/android/gradlew failed with return code: 1 2022-11-25T09:04:12.7409690Z at org.gradle.launcher.daemon.server.exec.ForwardClientInput$2.create(ForwardClientInput.java:75) 2022-11-25T09:04:12.7490480Z at ChildProcess.<anonymous> (/Users/runner/work/_tasks/Gradle_8d8eebd8-2b94-4c97-85af-839254cc6da4/1.128.0/node_modules/vsts-task-lib/toolrunner.js:569:30) 2022-11-25T09:04:12.7491340Z at org.gradle.util.Swapper.swap(Swapper.java:38) 2022-11-25T09:04:12.7573790Z at emitTwo (events.js:106:13) 2022-11-25T09:04:12.7574540Z at org.gradle.launcher.daemon.server.exec.ForwardClientInput.execute(ForwardClientInput.java:75) 2022-11-25T09:04:12.7654010Z at ChildProcess.emit (events.js:191:7) 2022-11-25T09:04:12.7654730Z at org.gradle.launcher.daemon.server.api.DaemonCommandExecution.proceed(DaemonCommandExecution.java:104) 2022-11-25T09:04:12.7742400Z at maybeClose (internal/child_process.js:920:16) 2022-11-25T09:04:12.7743110Z at org.gradle.launcher.daemon.server.exec.LogAndCheckHealth.execute(LogAndCheckHealth.java:55) 2022-11-25T09:04:12.7822490Z at Socket.<anonymous> (internal/child_process.js:351:11) 2022-11-25T09:04:12.7823240Z at org.gradle.launcher.daemon.server.api.DaemonCommandExecution.proceed(DaemonCommandExecution.java:104) 2022-11-25T09:04:12.7901340Z at emitOne (events.js:96:13) 2022-11-25T09:04:12.7902000Z at org.gradle.launcher.daemon.server.exec.LogToClient.doBuild(LogToClient.java:63) 2022-11-25T09:04:12.7985790Z at Socket.emit (events.js:188:7) 2022-11-25T09:04:12.7987070Z at org.gradle.launcher.daemon.server.exec.BuildCommandOnly.execute(BuildCommandOnly.java:37) 2022-11-25T09:04:12.8074930Z at Pipe._handle.close [as _onclose] (net.js:509:12) 2022-11-25T09:04:12.8075680Z at org.gradle.launcher.daemon.server.api.DaemonCommandExecution.proceed(DaemonCommandExecution.java:104) 2022-11-25T09:04:12.8177660Z at org.gradle.launcher.daemon.server.exec.EstablishBuildEnvironment.doBuild(EstablishBuildEnvironment.java:82) 2022-11-25T09:04:12.8235850Z at org.gradle.launcher.daemon.server.exec.BuildCommandOnly.execute(BuildCommandOnly.java:37) 2022-11-25T09:04:12.8302910Z at org.gradle.launcher.daemon.server.api.DaemonCommandExecution.proceed(DaemonCommandExecution.java:104) 2022-11-25T09:04:12.8365190Z at org.gradle.launcher.daemon.server.exec.StartBuildOrRespondWithBusy$1.run(StartBuildOrRespondWithBusy.java:52) 2022-11-25T09:04:12.8405150Z at org.gradle.launcher.daemon.server.DaemonStateCoordinator$1.run(DaemonStateCoordinator.java:297) 2022-11-25T09:04:12.8447850Z at org.gradle.internal.concurrent.ExecutorPolicy$CatchAndRecordFailures.onExecute(ExecutorPolicy.java:64) 2022-11-25T09:04:12.8549890Z at org.gradle.internal.concurrent.ManagedExecutorImpl$1.run(ManagedExecutorImpl.java:48) 2022-11-25T09:04:12.8650260Z at java.util.concurrent.ThreadPoolExecutor.runWorker(ThreadPoolExecutor.java:1149) 2022-11-25T09:04:12.8750570Z at java.util.concurrent.ThreadPoolExecutor$Worker.run(ThreadPoolExecutor.java:624) 2022-11-25T09:04:12.8851080Z at org.gradle.internal.concurrent.ThreadFactoryImpl$ManagedThreadRunnable.run(ThreadFactoryImpl.java:56) 2022-11-25T09:04:12.8951020Z at java.lang.Thread.run(Thread.java:750) 2022-11-25T09:04:12.9048700Z 2022-11-25T09:04:12.9150690Z FAILURE: Build failed with an exception. 2022-11-25T09:04:12.9245900Z 2022-11-25T09:04:12.9346780Z * What went wrong: 2022-11-25T09:04:12.9448140Z Execution failed for task ':react-native-firebase_messaging:compileReleaseJavaWithJavac'. 2022-11-25T09:04:12.9547310Z > Compilation failed; see the compiler error output for details. 2022-11-25T09:04:12.9646890Z 2022-11-25T09:04:12.9748000Z * Try: 2022-11-25T09:04:12.9849750Z Run with --stacktrace option to get the stack trace. Run with --info or --debug option to get more log output. Run with --scan to get full insights. 2022-11-25T09:04:12.9947930Z 2022-11-25T09:04:13.0049560Z * Get more help at https://help.gradle.org 2022-11-25T09:04:13.0149160Z 2022-11-25T09:04:13.0249910Z BUILD FAILED in 3m 42s 2022-11-25T09:04:13.0350810Z 2022-11-25T09:04:13.0451830Z Deprecated Gradle features were used in this build, making it incompatible with Gradle 7.0. 2022-11-25T09:04:13.0553660Z Use '--warning-mode all' to show the individual deprecation warnings. 2022-11-25T09:04:13.0652460Z See https://docs.gradle.org/6.5/***guide/command_line_interface.html#sec:command_line_warnings 2022-11-25T09:04:13.0754490Z 310 actionable tasks: 284 executed, 26 up-to-date 2022-11-25T09:04:13.2294430Z ##[error]Error: /Users/runner/work/1/s/android/gradlew failed with return code: 1 2022-11-25T09:04:13.2433530Z ##[section]Finishing: Gradle Task 2022-11-25T09:04:15.7280630Z ##[section]Starting: Sign APK 2022-11-25T09:04:15.7292370Z ============================================================================== 2022-11-25T09:04:15.7292740Z Task : Android signing 2022-11-25T09:04:15.7293050Z Description : Sign and align Android APK files 2022-11-25T09:04:15.7293310Z Version : 3.201.0 2022-11-25T09:04:15.7293570Z Author : Microsoft Corporation 2022-11-25T09:04:15.7293970Z Help : https://docs.microsoft.com/azure/devops/pipelines/tasks/build/android-signing 2022-11-25T09:04:15.7294430Z ============================================================================== 2022-11-25T09:04:16.2741940Z ##[section]Finishing: Sign APK 2022-11-25T09:04:17.2637460Z ##[section]Starting: Checkout euretco-spa@master to s 2022-11-25T09:04:17.2645270Z ============================================================================== 2022-11-25T09:04:17.2645670Z Task : Get sources 2022-11-25T09:04:17.2646080Z Description : Get sources from a repository. Supports Git, TfsVC, and SVN repositories. 2022-11-25T09:04:17.2646420Z Version : 1.0.0 2022-11-25T09:04:17.2646690Z Author : Microsoft 2022-11-25T09:04:17.2647040Z Help : [More Information](https://go.microsoft.com/fwlink/?LinkId=798199) 2022-11-25T09:04:17.2647530Z ============================================================================== 2022-11-25T09:04:17.9091450Z Cleaning any cached credential from repository: euretco-spa (ExternalGit) 2022-11-25T09:04:17.9406760Z ##[section]Finishing: Checkout euretco-spa@master to s 2022-11-25T09:04:18.7312930Z ##[section]Starting: Finalize Job 2022-11-25T09:04:18.7351140Z Cleaning up task key 2022-11-25T09:04:18.7356470Z Start cleaning up orphan processes. 2022-11-25T09:04:19.4097840Z Terminate orphan process: pid (5514) (java) 2022-11-25T09:04:19.4556870Z ##[section]Finishing: Finalize Job 2022-11-25T09:04:19.4630570Z ##[section]Finishing: Build   Mendix Version: 9.18.1 Build Native App version: v1.0.128   Does anyone know how to resolve this issue? Thanks!
asked
1 answers
1

Add this to your build config in appcenter:

answered