Java action failed after upgrading to 9.4.0

1
Hello, After upgrading to version 9.4.0, I am getting this error from one of my java actions. Has anyone faced this kind of issue yet?   Buildfile: C:\Users\KG-T\OneDrive - FC\Documents\Mendix\esvs Platform-Datagrid_rsch_branch\deployment\build_core.xml compile:     [javac] Compiling 707 source files to C:\Users\KG-T\OneDrive - FC\Documents\Mendix\esvs Platform-Datagrid_rsch_branch\deployment\run\bin     [javac] C:\Users\KG-T\OneDrive - FC\Documents\Mendix\esvs Platform-Datagrid_rsch_branch\javasource\barcode\actions\JA_Barcode_Generate.java:55: error: cannot find symbol     [javac]         if (this.BarcodeParameter1 == null)     [javac]                 ^     [javac]   symbol: variable BarcodeParameter1     [javac] C:\Users\KG-T\OneDrive - FC\Documents\Mendix\esvs Platform-Datagrid_rsch_branch\javasource\barcode\actions\JA_Barcode_Generate.java:57: error: cannot find symbol     [javac]         String EAN = this.BarcodeParameter1.getEAN();     [javac]                          ^     [javac]   symbol: variable BarcodeParameter1     [javac] C:\Users\KG-T\OneDrive - FC\Documents\Mendix\esvs Platform-Datagrid_rsch_branch\javasource\barcode\actions\JA_Barcode_Generate.java:63: error: cannot find symbol     [javac]             if (!this.BarcodeParameter1.getorientation().toString().isEmpty()) {     [javac]                      ^     [javac]   symbol: variable BarcodeParameter1     [javac] C:\Users\KG-T\OneDrive - FC\Documents\Mendix\esvs Platform-Datagrid_rsch_branch\javasource\barcode\actions\JA_Barcode_Generate.java:64: error: cannot find symbol     [javac]                 if (this.BarcodeParameter1.getorientation()>=0 && this.BarcodeParameter1.getorientation()<=360) {     [javac]                         ^     [javac]   symbol: variable BarcodeParameter1     [javac] C:\Users\KG-T\OneDrive - FC\Documents\Mendix\esvs Platform-Datagrid_rsch_branch\javasource\barcode\actions\JA_Barcode_Generate.java:64: error: cannot find symbol     [javac]                 if (this.BarcodeParameter1.getorientation()>=0 && this.BarcodeParameter1.getorientation()<=360) {     [javac]                                                                       ^     [javac]   symbol: variable BarcodeParameter1     [javac] C:\Users\KG-T\OneDrive - FC\Documents\Mendix\esvs Platform-Datagrid_rsch_branch\javasource\barcode\actions\JA_Barcode_Generate.java:65: error: cannot find symbol     [javac]                     orientation = this.BarcodeParameter1.getorientation();     [javac]                                       ^     [javac]   symbol: variable BarcodeParameter1     [javac] C:\Users\KG-T\OneDrive - FC\Documents\Mendix\esvs Platform-Datagrid_rsch_branch\javasource\barcode\actions\JA_Barcode_Generate.java:69: error: cannot find symbol     [javac]             if (!this.BarcodeParameter1.getheightMultiplier().toString().isEmpty()) {     [javac]                      ^     [javac]   symbol: variable BarcodeParameter1     [javac] C:\Users\KG-T\OneDrive - FC\Documents\Mendix\esvs Platform-Datagrid_rsch_branch\javasource\barcode\actions\JA_Barcode_Generate.java:70: error: cannot find symbol     [javac]                 h = this.BarcodeParameter1.getheightMultiplier();     [javac]                         ^     [javac]   symbol: variable BarcodeParameter1     [javac] C:\Users\KG-T\OneDrive - FC\Documents\Mendix\esvs Platform-Datagrid_rsch_branch\javasource\barcode\actions\JA_Barcode_Generate.java:75: error: cannot find symbol     [javac]             switch (this.BarcodeParameter1.getBarcodeType()) {     [javac]                         ^     [javac]   symbol: variable BarcodeParameter1     [javac] C:\Users\KG-T\OneDrive - FC\Documents\Mendix\esvs Platform-Datagrid_rsch_branch\javasource\barcode\actions\JA_Barcode_Generate.java:76: error: cannot find symbol     [javac]             case Codabar:     [javac]                  ^     [javac]   symbol:   variable Codabar     [javac]   location: class JA_Barcode_Generate     [javac] C:\Users\KG-T\OneDrive - FC\Documents\Mendix\esvs Platform-Datagrid_rsch_branch\javasource\barcode\actions\JA_Barcode_Generate.java:78: error: cannot find symbol     [javac]                 if (!this.BarcodeParameter1.getshowBarcodeText()) {beanCodaBar.setMsgPosition(HumanReadablePlacement.HRP_NONE);}     [javac]                          ^     [javac]   symbol: variable BarcodeParameter1     [javac] C:\Users\KG-T\OneDrive - FC\Documents\Mendix\esvs Platform-Datagrid_rsch_branch\javasource\barcode\actions\JA_Barcode_Generate.java:83: error: cannot find symbol     [javac]             case Code_128:     [javac]                  ^     [javac]   symbol:   variable Code_128     [javac]   location: class JA_Barcode_Generate     [javac] C:\Users\KG-T\OneDrive - FC\Documents\Mendix\esvs Platform-Datagrid_rsch_branch\javasource\barcode\actions\JA_Barcode_Generate.java:85: error: cannot find symbol     [javac]                 if (!this.BarcodeParameter1.getshowBarcodeText()) {bean128.setMsgPosition(HumanReadablePlacement.HRP_NONE);}     [javac]                          ^     [javac]   symbol: variable BarcodeParameter1     [javac] C:\Users\KG-T\OneDrive - FC\Documents\Mendix\esvs Platform-Datagrid_rsch_branch\javasource\barcode\actions\JA_Barcode_Generate.java:90: error: cannot find symbol     [javac]             case Code_39:     [javac]                  ^     [javac]   symbol:   variable Code_39     [javac]   location: class JA_Barcode_Generate     [javac] C:\Users\KG-T\OneDrive - FC\Documents\Mendix\esvs Platform-Datagrid_rsch_branch\javasource\barcode\actions\JA_Barcode_Generate.java:92: error: cannot find symbol     [javac]                 if (!this.BarcodeParameter1.getshowBarcodeText()) {bean39.setMsgPosition(HumanReadablePlacement.HRP_NONE);}     [javac]                          ^     [javac]   symbol: variable BarcodeParameter1     [javac] C:\Users\KG-T\OneDrive - FC\Documents\Mendix\esvs Platform-Datagrid_rsch_branch\javasource\barcode\actions\JA_Barcode_Generate.java:97: error: cannot find symbol     [javac]             case Interleaved_2_of_5:     [javac]                  ^     [javac]   symbol:   variable Interleaved_2_of_5     [javac]   location: class JA_Barcode_Generate     [javac] C:\Users\KG-T\OneDrive - FC\Documents\Mendix\esvs Platform-Datagrid_rsch_branch\javasource\barcode\actions\JA_Barcode_Generate.java:99: error: cannot find symbol     [javac]                 if (!this.BarcodeParameter1.getshowBarcodeText()) {beanInterleaved.setMsgPosition(HumanReadablePlacement.HRP_NONE);}     [javac]                          ^     [javac]   symbol: variable BarcodeParameter1     [javac] C:\Users\KG-T\OneDrive - FC\Documents\Mendix\esvs Platform-Datagrid_rsch_branch\javasource\barcode\actions\JA_Barcode_Generate.java:104: error: cannot find symbol     [javac]             case Postnet:     [javac]                  ^     [javac]   symbol:   variable Postnet     [javac]   location: class JA_Barcode_Generate     [javac] C:\Users\KG-T\OneDrive - FC\Documents\Mendix\esvs Platform-Datagrid_rsch_branch\javasource\barcode\actions\JA_Barcode_Generate.java:106: error: cannot find symbol     [javac]                 if (!this.BarcodeParameter1.getshowBarcodeText()) {beanPostnet.setMsgPosition(HumanReadablePlacement.HRP_NONE);}     [javac]                          ^     [javac]   symbol: variable BarcodeParameter1     [javac] C:\Users\KG-T\OneDrive - FC\Documents\Mendix\esvs Platform-Datagrid_rsch_branch\javasource\barcode\actions\JA_Barcode_Generate.java:111: error: cannot find symbol     [javac]             case EAN13:     [javac]                  ^     [javac]   symbol:   variable EAN13     [javac]   location: class JA_Barcode_Generate     [javac] C:\Users\KG-T\OneDrive - FC\Documents\Mendix\esvs Platform-Datagrid_rsch_branch\javasource\barcode\actions\JA_Barcode_Generate.java:113: error: cannot find symbol     [javac]                 if (!this.BarcodeParameter1.getshowBarcodeText()) {beanEAN13.setMsgPosition(HumanReadablePlacement.HRP_NONE);}     [javac]                          ^     [javac]   symbol: variable BarcodeParameter1     [javac] C:\Users\KG-T\OneDrive - FC\Documents\Mendix\esvs Platform-Datagrid_rsch_branch\javasource\barcode\actions\JA_Barcode_Generate.java:118: error: cannot find symbol     [javac]             case EAN8:     [javac]                  ^     [javac]   symbol:   variable EAN8     [javac]   location: class JA_Barcode_Generate     [javac] C:\Users\KG-T\OneDrive - FC\Documents\Mendix\esvs Platform-Datagrid_rsch_branch\javasource\barcode\actions\JA_Barcode_Generate.java:120: error: cannot find symbol     [javac]                 if (!this.BarcodeParameter1.getshowBarcodeText()) {beanEAN8.setMsgPosition(HumanReadablePlacement.HRP_NONE);}     [javac]                          ^     [javac]   symbol: variable BarcodeParameter1     [javac] C:\Users\KG-T\OneDrive - FC\Documents\Mendix\esvs Platform-Datagrid_rsch_branch\javasource\barcode\actions\JA_Barcode_Generate.java:125: error: cannot find symbol     [javac]             case UPCA:     [javac]                  ^     [javac]   symbol:   variable UPCA     [javac]   location: class JA_Barcode_Generate     [javac] C:\Users\KG-T\OneDrive - FC\Documents\Mendix\esvs Platform-Datagrid_rsch_branch\javasource\barcode\actions\JA_Barcode_Generate.java:127: error: cannot find symbol     [javac]                 if (!this.BarcodeParameter1.getshowBarcodeText()) {beanUPCA.setMsgPosition(HumanReadablePlacement.HRP_NONE);}     [javac]                          ^     [javac]   symbol: variable BarcodeParameter1     [javac] C:\Users\KG-T\OneDrive - FC\Documents\Mendix\esvs Platform-Datagrid_rsch_branch\javasource\barcode\actions\JA_Barcode_Generate.java:132: error: cannot find symbol     [javac]             case UPCE:     [javac]                  ^     [javac]   symbol:   variable UPCE     [javac]   location: class JA_Barcode_Generate     [javac] C:\Users\KG-T\OneDrive - FC\Documents\Mendix\esvs Platform-Datagrid_rsch_branch\javasource\barcode\actions\JA_Barcode_Generate.java:134: error: cannot find symbol     [javac]                 if (!this.BarcodeParameter1.getshowBarcodeText()) {beanUPCE.setMsgPosition(HumanReadablePlacement.HRP_NONE);}     [javac]                          ^     [javac]   symbol: variable BarcodeParameter1     [javac] C:\Users\KG-T\OneDrive - FC\Documents\Mendix\esvs Platform-Datagrid_rsch_branch\javasource\barcode\actions\JA_Barcode_Generate.java:139: error: cannot find symbol     [javac]             case EAN128:     [javac]                  ^     [javac]   symbol:   variable EAN128     [javac]   location: class JA_Barcode_Generate     [javac] C:\Users\KG-T\OneDrive - FC\Documents\Mendix\esvs Platform-Datagrid_rsch_branch\javasource\barcode\actions\JA_Barcode_Generate.java:141: error: cannot find symbol     [javac]                 if (!this.BarcodeParameter1.getshowBarcodeText()) {beanEAN128.setMsgPosition(HumanReadablePlacement.HRP_NONE);}     [javac]                          ^     [javac]   symbol: variable BarcodeParameter1     [javac] C:\Users\KG-T\OneDrive - FC\Documents\Mendix\esvs Platform-Datagrid_rsch_branch\javasource\barcode\actions\JA_Barcode_Generate.java:162: error: cannot find symbol     [javac]                     this.BarcodeParameter1.setName("barcode.png");     [javac]                         ^     [javac]   symbol: variable BarcodeParameter1     [javac] C:\Users\KG-T\OneDrive - FC\Documents\Mendix\esvs Platform-Datagrid_rsch_branch\javasource\barcode\actions\JA_Barcode_Generate.java:163: error: cannot find symbol     [javac]                     Core.storeImageDocumentContent(getContext(), BarcodeParameter1.getMendixObject(), is, symbol.getWidth(), symbol.getHeight());     [javac]                                                                  ^     [javac]   symbol:   variable BarcodeParameter1     [javac]   location: class JA_Barcode_Generate     [javac] C:\Users\KG-T\OneDrive - FC\Documents\Mendix\esvs Platform-Datagrid_rsch_branch\javasource\communitycommons\Misc.java:336: error: method execute in class Core cannot be applied to given types;     [javac]         return Core.execute(c, microflowName, params);     [javac]                    ^     [javac]   required: T     [javac]   found: IContext,String,Map<String,Object>     [javac]   reason: cannot infer type-variable(s) T,R     [javac]     (actual and formal argument lists differ in length)     [javac]   where T,R are type-variables:     [javac]     T extends CoreAction<R> declared in method <T,R>execute(T)     [javac]     R extends Object declared in method <T,R>execute(T)     [javac] C:\Users\KG-T\OneDrive - FC\Documents\Mendix\esvs Platform-Datagrid_rsch_branch\javasource\deeplink\actions\ExecuteDeeplink.java:74: error: method execute in class Core cannot be applied to given types;     [javac]                     Core.execute(getContext(), link.getMicroflow(), arg);     [javac]                         ^     [javac]   required: T     [javac]   found: IContext,String,IMendixObject     [javac]   reason: cannot infer type-variable(s) T,R     [javac]     (actual and formal argument lists differ in length)     [javac]   where T,R are type-variables:     [javac]     T extends CoreAction<R> declared in method <T,R>execute(T)     [javac]     R extends Object declared in method <T,R>execute(T)     [javac] C:\Users\KG-T\OneDrive - FC\Documents\Mendix\esvs Platform-Datagrid_rsch_branch\javasource\deeplink\actions\ExecuteDeeplink.java:99: error: method execute in class Core cannot be applied to given types;     [javac]                     Core.execute(getContext(), link.getMicroflow(), args);     [javac]                         ^     [javac]   required: T     [javac]   found: IContext,String,Map<String,Object>     [javac]   reason: cannot infer type-variable(s) T,R     [javac]     (actual and formal argument lists differ in length)     [javac]   where T,R are type-variables:     [javac]     T extends CoreAction<R> declared in method <T,R>execute(T)     [javac]     R extends Object declared in method <T,R>execute(T)     [javac] C:\Users\KG-T\OneDrive - FC\Documents\Mendix\esvs Platform-Datagrid_rsch_branch\javasource\deeplink\actions\ExecuteDeeplink.java:101: error: method execute in class Core cannot be applied to given types;     [javac]                     Core.execute(getContext(), link.getMicroflow());     [javac]                         ^     [javac]   required: T     [javac]   found: IContext,String     [javac]   reason: cannot infer type-variable(s) T,R     [javac]     (actual and formal argument lists differ in length)     [javac]   where T,R are type-variables:     [javac]     T extends CoreAction<R> declared in method <T,R>execute(T)     [javac]     R extends Object declared in method <T,R>execute(T)     [javac] C:\Users\KG-T\OneDrive - FC\Documents\Mendix\esvs Platform-Datagrid_rsch_branch\javasource\eservices_audittrail\log\diff_match_patch.java:1806: warning: [dep-ann] deprecated item is not annotated with @Deprecated     [javac]   public LinkedList<Patch> patch_make(String text1, String text2,     [javac]                            ^     [javac] C:\Users\KG-T\OneDrive - FC\Documents\Mendix\esvs Platform-Datagrid_rsch_branch\javasource\fcutilities\misc\RunnableListProcessor.java:29: error: method execute in class Core cannot be applied to given types;     [javac]             Core.execute(c, ListProcessor, true, inputParameters);     [javac]                 ^     [javac]   required: T     [javac]   found: IContext,String,boolean,Map<String,Object>     [javac]   reason: cannot infer type-variable(s) T,R     [javac]     (actual and formal argument lists differ in length)     [javac]   where T,R are type-variables:     [javac]     T extends CoreAction<R> declared in method <T,R>execute(T)     [javac]     R extends Object declared in method <T,R>execute(T)     [javac] C:\Users\KG-T\OneDrive - FC\Documents\Mendix\esvs Platform-Datagrid_rsch_branch\javasource\ldap\actions\ImportLdapGroups_Group.java:46: error: cannot find symbol     [javac]             Result result = ImportUserRecord.runImportGroupsByGroup(this.LdapServerParameter1);     [javac]                                                                         ^     [javac]   symbol: variable LdapServerParameter1     [javac] C:\Users\KG-T\OneDrive - FC\Documents\Mendix\esvs Platform-Datagrid_rsch_branch\javasource\ldap\actions\ImportLdapGroups_Path.java:44: error: cannot find symbol     [javac]             Result result = ImportUserRecord.runImportGroups(this.LdapServerParameter1);     [javac]                                                                  ^     [javac]   symbol: variable LdapServerParameter1     [javac] C:\Users\KG-T\OneDrive - FC\Documents\Mendix\esvs Platform-Datagrid_rsch_branch\javasource\multithreading\misc\CallableListProcessor.java:42: error: method execute in class Core cannot be applied to given types;     [javac]                 List<IMendixObject> returnList = Core.execute(c, ListProcessor, true, inputParameters);     [javac]                                                      ^     [javac]   required: T     [javac]   found: IContext,String,boolean,Map<String,Object>     [javac]   reason: cannot infer type-variable(s) T,R     [javac]     (actual and formal argument lists differ in length)     [javac]   where T,R are type-variables:     [javac]     T extends CoreAction<R> declared in method <T,R>execute(T)     [javac]     R extends Object declared in method <T,R>execute(T)     [javac] C:\Users\KG-T\OneDrive - FC\Documents\Mendix\esvs Platform-Datagrid_rsch_branch\javasource\multithreading\misc\CallableListProcessor.java:45: error: method execute in class Core cannot be applied to given types;     [javac]                 IMendixObject returnObject = Core.execute(c, ListProcessor, true, inputParameters);     [javac]                                                  ^     [javac]   required: T     [javac]   found: IContext,String,boolean,Map<String,Object>     [javac]   reason: cannot infer type-variable(s) T,R     [javac]     (actual and formal argument lists differ in length)     [javac]   where T,R are type-variables:     [javac]     T extends CoreAction<R> declared in method <T,R>execute(T)     [javac]     R extends Object declared in method <T,R>execute(T)     [javac] C:\Users\KG-T\OneDrive - FC\Documents\Mendix\esvs Platform-Datagrid_rsch_branch\javasource\multithreading\misc\RunnableListProcessor.java:31: error: method execute in class Core cannot be applied to given types;     [javac]             Core.execute(c, ListProcessor, true, inputParameters);     [javac]                 ^     [javac]   required: T     [javac]   found: IContext,String,boolean,Map<String,Object>     [javac]   reason: cannot infer type-variable(s) T,R     [javac]     (actual and formal argument lists differ in length)     [javac]   where T,R are type-variables:     [javac]     T extends CoreAction<R> declared in method <T,R>execute(T)     [javac]     R extends Object declared in method <T,R>execute(T)     [javac] C:\Users\KG-T\OneDrive - FC\Documents\Mendix\esvs Platform-Datagrid_rsch_branch\javasource\oql_modeler\actions\getMicroflowModuleAndName.java:42: error: incompatible types: Stack<ICoreAction<?>> cannot be converted to Stack<CoreAction<?>>     [javac]             coreAction = context.getActionStack();     [javac]                                                ^     [javac] C:\Users\KG-T\OneDrive - FC\Documents\Mendix\esvs Platform-Datagrid_rsch_branch\javasource\processqueue\queuehandler\ObjectQueueExecutor.java:138: error: method execute in class Core cannot be applied to given types;     [javac]                         Object booleanResult = Core.execute(this.context, this.microflowName, this.action);     [javac]                                                    ^     [javac]   required: T     [javac]   found: IContext,String,IMendixObject     [javac]   reason: cannot infer type-variable(s) T,R     [javac]     (actual and formal argument lists differ in length)     [javac]   where T,R are type-variables:     [javac]     T extends CoreAction<R> declared in method <T,R>execute(T)     [javac]     R extends Object declared in method <T,R>execute(T)     [javac] C:\Users\KG-T\OneDrive - FC\Documents\Mendix\esvs Platform-Datagrid_rsch_branch\javasource\processqueue\queuehandler\ObjectQueueExecutor.java:222: error: method execute in class Core cannot be applied to given types;     [javac]             Core.execute(context, "ProcessQueue.SF_WriteExecutionLog", paramMap);     [javac]                 ^     [javac]   required: T     [javac]   found: IContext,String,HashMap<String,Object>     [javac]   reason: cannot infer type-variable(s) T,R     [javac]     (actual and formal argument lists differ in length)     [javac]   where T,R are type-variables:     [javac]     T extends CoreAction<R> declared in method <T,R>execute(T)     [javac]     R extends Object declared in method <T,R>execute(T)     [javac] C:\Users\KG-T\OneDrive - FC\Documents\Mendix\esvs Platform-Datagrid_rsch_branch\javasource\processqueue\queuehandler\ObjectQueueExecutor.java:240: error: method execute in class Core cannot be applied to given types;     [javac]             Core.execute(this.context, "ProcessQueue.SF_WriteExecutionLog", paramMap);     [javac]                 ^     [javac]   required: T     [javac]   found: IContext,String,HashMap<String,Object>     [javac]   reason: cannot infer type-variable(s) T,R     [javac]     (actual and formal argument lists differ in length)     [javac]   where T,R are type-variables:     [javac]     T extends CoreAction<R> declared in method <T,R>execute(T)     [javac]     R extends Object declared in method <T,R>execute(T)     [javac] C:\Users\KG-T\OneDrive - FC\Documents\Mendix\esvs Platform-Datagrid_rsch_branch\javasource\unittesting\TestManager.java:130: error: method execute in class Core cannot be applied to given types;     [javac]                 Core.execute(Core.createSystemContext(), testSuite.getModule() + ".Setup", emptyArguments);     [javac]                     ^     [javac]   required: T     [javac]   found: IContext,String,Map<String,Object>     [javac]   reason: cannot infer type-variable(s) T,R     [javac]     (actual and formal argument lists differ in length)     [javac]   where T,R are type-variables:     [javac]     T extends CoreAction<R> declared in method <T,R>execute(T)     [javac]     R extends Object declared in method <T,R>execute(T)     [javac] C:\Users\KG-T\OneDrive - FC\Documents\Mendix\esvs Platform-Datagrid_rsch_branch\javasource\unittesting\TestManager.java:145: error: method execute in class Core cannot be applied to given types;     [javac]                 Core.execute(Core.createSystemContext(), testSuite.getModule() + ".TearDown", emptyArguments);     [javac]                     ^     [javac]   required: T     [javac]   found: IContext,String,Map<String,Object>     [javac]   reason: cannot infer type-variable(s) T,R     [javac]     (actual and formal argument lists differ in length)     [javac]   where T,R are type-variables:     [javac]     T extends CoreAction<R> declared in method <T,R>execute(T)     [javac]     R extends Object declared in method <T,R>execute(T)     [javac] C:\Users\KG-T\OneDrive - FC\Documents\Mendix\esvs Platform-Datagrid_rsch_branch\javasource\unittesting\TestManager.java:323: error: method execute in class Core cannot be applied to given types;     [javac]             Object resultObject = Core.execute(mfContext, mf, emptyArguments);     [javac]                                       ^     [javac]   required: T     [javac]   found: IContext,String,Map<String,Object>     [javac]   reason: cannot infer type-variable(s) T,R     [javac]     (actual and formal argument lists differ in length)     [javac]   where T,R are type-variables:     [javac]     T extends CoreAction<R> declared in method <T,R>execute(T)     [javac]     R extends Object declared in method <T,R>execute(T)     [javac] Note: Some input files use or override a deprecated API.     [javac] Note: Recompile with -Xlint:deprecation for details.     [javac] Note: C:\Users\KG-T\OneDrive - FC\Documents\Mendix\esvs Platform-Datagrid_rsch_branch\javasource\saml20\implementation\common\MendixUtils.java uses unchecked or unsafe operations.     [javac] Note: Recompile with -Xlint:unchecked for details.     [javac] 48 errors     [javac] 1 warning BUILD FAILED C:\Users\KG-T\OneDrive - FC\Documents\Mendix\esvs Platform-Datagrid_rsch_branch\deployment\build_core.xml:29: Compile failed; see the compiler error output for details. Total time: 9 seconds
asked
1 answers
0

One of the errors you have in there is the module using a version of Core.execute that was deprecated in Mendix 8.6. 

It is probably worth checking if there is a newer version of the module on the Marketplace that can be downloaded and is hopefully compatible with Mendix 9.4.

If there isn’t a newer version, I recommend you contact the author to see if they can publish a newer version.

Hope this helps.

answered